Target
5-hydroxytryptamine receptor 2A
Ligand
BDBM50457769
Substrate
Meas. Tech.
ChEMBL_1760594 (CHEMBL4195602)
Ki
343±n/a nM
Citation
 Kelemen, ÁASata?a, GBojarski, AJKeser?, GM Spiro[pyrrolidine-3,3'-oxindoles] as 5-HT Bioorg Med Chem Lett 28:2418-2421 (2018)  
Target
Name:
5-hydroxytryptamine receptor 2A
Synonyms:
5-HT-2 5-HT2A 5-hydroxytryptamine receptor 2A (5HT-2A) 5HT2A_HUMAN HTR2A | Serotonin receptor 2A
Type:
undefined
Mol. Mass.:
52607.65
Organism:
Homo sapiens (Human)
Description:
P28223
Residue:
471
  
Inhibitor
Name:
BDBM50457769
Synonyms:
CHEMBL4208468
Type:
Small organic molecule
Emp. Form.:
C24H28ClN3O2
Mol. Mass.:
425.951
SMILES:
Clc1ccc(OC2CCN(CCN3CCC4(C3)C(=O)Nc3ccccc43)CC2)cc1
: