Target
5-hydroxytryptamine receptor 7
Ligand
BDBM50457769
Substrate
Meas. Tech.
ChEMBL_1760592 (CHEMBL4195600)
Ki
121±n/a nM
Citation
 Kelemen, ÁASata?a, GBojarski, AJKeser?, GM Spiro[pyrrolidine-3,3'-oxindoles] as 5-HT Bioorg Med Chem Lett 28:2418-2421 (2018)  
Target
Name:
5-hydroxytryptamine receptor 7
Synonyms:
5-HT-7 5-HT7 5-HT7S 5HT7 HTR7 | Serotonin receptor 7
Type:
G Protein-Coupled Receptor (GPCR)
Mol. Mass.:
53573.08
Organism:
Homo sapiens (Human)
Description:
P34969
Residue:
479
  
Inhibitor
Name:
BDBM50457769
Synonyms:
CHEMBL4208468
Type:
Small organic molecule
Emp. Form.:
C24H28ClN3O2
Mol. Mass.:
425.951
SMILES:
Clc1ccc(OC2CCN(CCN3CCC4(C3)C(=O)Nc3ccccc43)CC2)cc1
: