Target
5-hydroxytryptamine receptor 6
Ligand
BDBM50457769
Substrate
Meas. Tech.
ChEMBL_1760595 (CHEMBL4195603)
Ki
1693±n/a nM
Citation
 Kelemen, ÁASata?a, GBojarski, AJKeser?, GM Spiro[pyrrolidine-3,3'-oxindoles] as 5-HT Bioorg Med Chem Lett 28:2418-2421 (2018)  
Target
Name:
5-hydroxytryptamine receptor 6
Synonyms:
5-HT-6 5-hydroxytryptamine receptor 6 (5-HT-6) 5-hydroxytryptamine receptor 6 (5HT6) HTR6 Serotonin 6 (5-HT6) receptor | Serotonin Receptor 6
Type:
G Protein-Coupled Receptor (GPCR)
Mol. Mass.:
46968.43
Organism:
Homo sapiens (Human)
Description:
P50406
Residue:
440
  
Inhibitor
Name:
BDBM50457769
Synonyms:
CHEMBL4208468
Type:
Small organic molecule
Emp. Form.:
C24H28ClN3O2
Mol. Mass.:
425.951
SMILES:
Clc1ccc(OC2CCN(CCN3CCC4(C3)C(=O)Nc3ccccc43)CC2)cc1
: