Target
Matrix metalloproteinase-9
Ligand
BDBM50129952
Substrate
Meas. Tech.
ChEMBL_1760640 (CHEMBL4195648)
Kd
2180±n/a nM
Citation
 Wang, CGYao, WNZhang, BHua, JLiang, DWang, HS Lung cancer and matrix metalloproteinases inhibitors of polyphenols from Selaginella tamariscina with suppression activity of migration. Bioorg Med Chem Lett 28:2413-2417 (2018)  
Target
Name:
Matrix metalloproteinase-9
Synonyms:
67 kDa matrix metalloproteinase-9 92 kDa gelatinase CLG4B Gelatinase B MMP9 Matrix metalloproteinase 9 (MMP-9) Matrix metalloproteinase-9 (MMP9)
Type:
Enzyme
Mol. Mass.:
78452.28
Organism:
Homo sapiens (Human)
Description:
P14780
Residue:
707
  
Inhibitor
Name:
BDBM50129952
Synonyms:
2-(3-(5,7-dihydroxy-2-(4-hydroxyphenyl)-4-oxo-4H-chromen-8-yl)-4-hydroxyphenyl)-5,7-dihydroxy-4H-chromen-4-one Amentoflavone cid_5281600
Type:
Small organic molecule
Emp. Form.:
C30H18O10
Mol. Mass.:
538.4579
SMILES:
Oc1ccc(cc1)-c1cc(=O)c2c(O)cc(O)c(-c3cc(ccc3O)-c3cc(O)c4c(cc(O)cc4=O)o3)c2o1
: