Target
Mitogen-activated protein kinase kinase kinase 14
Ligand
BDBM50457811
Substrate
Meas. Tech.
ChEMBL_1760740 (CHEMBL4195748)
Ki
2.0±n/a nM
Citation
 Blaquiere, NCastanedo, GMBurch, JDBerezhkovskiy, LMBrightbill, HBrown, SChan, CChiang, PCCrawford, JJDong, TFan, PFeng, JGhilardi, NGodemann, RGogol, EGrabbe, AHole, AJHu, BHymowitz, SGAlaoui Ismaili, MHLe, HLee, PLee, WLin, XLiu, NMcEwan, PAMcKenzie, BSilvestre, HLSuto, ESujatha-Bhaskar, SWu, GWu, LCZhang, YZhong, ZStaben, ST Scaffold-Hopping Approach To Discover Potent, Selective, and Efficacious Inhibitors of NF-?B Inducing Kinase. J Med Chem 61:6801-6813 (2018)  
Target
Name:
Mitogen-activated protein kinase kinase kinase 14
Synonyms:
HsNIK MAP3K14 NF-kappa-beta-inducing kinase (NF-kB) Serine/threonine-protein kinase NIK
Type:
Protein
Mol. Mass.:
104059.50
Organism:
Homo sapiens (Human)
Description:
Q99558
Residue:
947
  
Inhibitor
Name:
BDBM50457811
Synonyms:
CHEMBL4210461
Type:
Small organic molecule
Emp. Form.:
C18H16N4O3
Mol. Mass.:
336.3446
SMILES:
CN1CC[C@@](O)(C#Cc2cccc(c2)-c2ccnc(n2)C(N)=O)C1=O
: