Target
Mitogen-activated protein kinase kinase kinase 14
Ligand
BDBM312762
Substrate
Meas. Tech.
ChEMBL_1760740 (CHEMBL4195748)
Ki
0.860000±n/a nM
Citation
 Blaquiere, NCastanedo, GMBurch, JDBerezhkovskiy, LMBrightbill, HBrown, SChan, CChiang, PCCrawford, JJDong, TFan, PFeng, JGhilardi, NGodemann, RGogol, EGrabbe, AHole, AJHu, BHymowitz, SGAlaoui Ismaili, MHLe, HLee, PLee, WLin, XLiu, NMcEwan, PAMcKenzie, BSilvestre, HLSuto, ESujatha-Bhaskar, SWu, GWu, LCZhang, YZhong, ZStaben, ST Scaffold-Hopping Approach To Discover Potent, Selective, and Efficacious Inhibitors of NF-?B Inducing Kinase. J Med Chem 61:6801-6813 (2018)  
Target
Name:
Mitogen-activated protein kinase kinase kinase 14
Synonyms:
HsNIK MAP3K14 NF-kappa-beta-inducing kinase (NF-kB) Serine/threonine-protein kinase NIK
Type:
Protein
Mol. Mass.:
104059.50
Organism:
Homo sapiens (Human)
Description:
Q99558
Residue:
947
  
Inhibitor
Name:
BDBM312762
Synonyms:
1-[4-[2-[(3R)-3-hydroxy-1- methyl-2-oxo-pyrrolidin-3- yl]ethynyl]-2-pyridyl]-4,5,6,7- tetrahydroindazole-3-carbox- amide | US9605005, Example 51
Type:
Small organic molecule
Emp. Form.:
C20H21N5O3
Mol. Mass.:
379.4124
SMILES:
CN1CC[C@@](O)(C#Cc2ccnc(c2)-n2nc(C(N)=O)c3CCCCc23)C1=O
: