Target
Mitogen-activated protein kinase kinase kinase 14
Ligand
BDBM312799
Substrate
Meas. Tech.
ChEMBL_1760740 (CHEMBL4195748)
Ki
4.7±n/a nM
Citation
 Blaquiere, NCastanedo, GMBurch, JDBerezhkovskiy, LMBrightbill, HBrown, SChan, CChiang, PCCrawford, JJDong, TFan, PFeng, JGhilardi, NGodemann, RGogol, EGrabbe, AHole, AJHu, BHymowitz, SGAlaoui Ismaili, MHLe, HLee, PLee, WLin, XLiu, NMcEwan, PAMcKenzie, BSilvestre, HLSuto, ESujatha-Bhaskar, SWu, GWu, LCZhang, YZhong, ZStaben, ST Scaffold-Hopping Approach To Discover Potent, Selective, and Efficacious Inhibitors of NF-?B Inducing Kinase. J Med Chem 61:6801-6813 (2018)  
Target
Name:
Mitogen-activated protein kinase kinase kinase 14
Synonyms:
HsNIK MAP3K14 NF-kappa-beta-inducing kinase (NF-kB) Serine/threonine-protein kinase NIK
Type:
Protein
Mol. Mass.:
104059.50
Organism:
Homo sapiens (Human)
Description:
Q99558
Residue:
947
  
Inhibitor
Name:
BDBM312799
Synonyms:
3-[3-[2-[(3R)-3-hydroxy-1- methyl-2-oxo-pyrrolidin-3- yl]ethynyl]phenyl]imidazo[1,5- a]pyridine-1-carboxamide US9605005, Example 88
Type:
Small organic molecule
Emp. Form.:
C21H18N4O3
Mol. Mass.:
374.3926
SMILES:
CN1CC[C@@](O)(C#Cc2cccc(c2)-c2nc(C(N)=O)c3ccccn23)C1=O
: