Target
Mitogen-activated protein kinase kinase kinase 14
Ligand
BDBM50457817
Substrate
Meas. Tech.
ChEMBL_1760740 (CHEMBL4195748)
Ki
0.590000±n/a nM
Citation
 Blaquiere, NCastanedo, GMBurch, JDBerezhkovskiy, LMBrightbill, HBrown, SChan, CChiang, PCCrawford, JJDong, TFan, PFeng, JGhilardi, NGodemann, RGogol, EGrabbe, AHole, AJHu, BHymowitz, SGAlaoui Ismaili, MHLe, HLee, PLee, WLin, XLiu, NMcEwan, PAMcKenzie, BSilvestre, HLSuto, ESujatha-Bhaskar, SWu, GWu, LCZhang, YZhong, ZStaben, ST Scaffold-Hopping Approach To Discover Potent, Selective, and Efficacious Inhibitors of NF-?B Inducing Kinase. J Med Chem 61:6801-6813 (2018)  
Target
Name:
Mitogen-activated protein kinase kinase kinase 14
Synonyms:
HsNIK MAP3K14 NF-kappa-beta-inducing kinase (NF-kB) Serine/threonine-protein kinase NIK
Type:
Protein
Mol. Mass.:
104059.50
Organism:
Homo sapiens (Human)
Description:
Q99558
Residue:
947
  
Inhibitor
Name:
BDBM50457817
Synonyms:
CHEMBL4214032
Type:
Small organic molecule
Emp. Form.:
C19H18N4O4
Mol. Mass.:
366.3706
SMILES:
COc1cc(nc(n1)-c1cccc(c1)C#C[C@]1(O)CCN(C)C1=O)C(N)=O
: