Target
Phosphatidylinositol 4-kinase beta
Ligand
BDBM50457854
Substrate
Meas. Tech.
ChEMBL_1760892 (CHEMBL4195900)
IC50
5.0±n/a nM
Citation
 Reuberson, JHorsley, HFranklin, RJFord, DNeuss, JBrookings, DHuang, QVanderhoydonck, BGao, LJJang, MYHerdewijn, PGhawalkar, AFallah-Arani, FKhan, ARHenshall, JJairaj, MMalcolm, SWard, EShuttleworth, LLin, YLi, SLouat, TWaer, MHerman, JPayne, ACeska, TDoyle, CPitt, WCalmiano, MAugustin, MSteinbacher, SLammens, AAllen, R Discovery of a Potent, Orally Bioavailable PI4KIII? Inhibitor (UCB9608) Able To Significantly Prolong Allogeneic Organ Engraftment in Vivo. J Med Chem 61:6705-6723 (2018)  
Target
Name:
Phosphatidylinositol 4-kinase beta
Synonyms:
NPIK PI4K-beta PI4KB PI4Kbeta PIK4CB Phosphatidylinositol 4-kinase, PI4K | PtdIns 4-kinase beta
Type:
Protein
Mol. Mass.:
91373.30
Organism:
Homo sapiens (Human)
Description:
Residue:
816
  
Inhibitor
Name:
BDBM50457854
Synonyms:
CHEMBL4206816
Type:
Small organic molecule
Emp. Form.:
C22H22N8OS
Mol. Mass.:
446.528
SMILES:
Cc1ccc(NC(=O)N2CCN(CC2)c2nc(N)nc3sc(nc23)-c2cccnc2)cc1
: