Target
Thymidine kinase, cytosolic
Ligand
BDBM50021777
Substrate
Meas. Tech.
ChEBML_207850
Ki
25000±n/a nM
Citation
 Haines, DRTseng, CKMarquez, VE Synthesis and biological activity of unsaturated carboacyclic purine nucleoside analogues. J Med Chem 30:943-7 (1987)  
Target
Name:
Thymidine kinase, cytosolic
Synonyms:
KITH_HUMAN | TK1
Type:
PROTEIN
Mol. Mass.:
25476.50
Organism:
Homo sapiens (Human)
Description:
ChEMBL_1333884
Residue:
234
  
Inhibitor
Name:
BDBM50021777
Synonyms:
2-Amino-9-(4-hydroxy-3-hydroxymethyl-but-2-enyl)-1,9-dihydro-purin-6-one | CHEMBL306477
Type:
Small organic molecule
Emp. Form.:
C10H13N5O3
Mol. Mass.:
251.2419
SMILES:
Nc1nc2n(CC=C(CO)CO)cnc2c(=O)[nH]1
: