Target
Cytochrome P450 11B1, mitochondrial
Ligand
BDBM7962
Substrate
Meas. Tech.
ChEBML_194
IC50
>100000±n/a nM
Citation
 Cross, PEDickinson, RPParry, MJRandall, MJ Selective thromboxane synthetase inhibitors. 2. 3-(1H-imidazol-1-ylmethyl)-2-methyl-1H-indole-1-propanoic acid and analogues. J Med Chem 29:342-6 (1986)  
Target
Name:
Cytochrome P450 11B1, mitochondrial
Synonyms:
C11B1_RAT Cyp11b1 Cytochrome P450 11B1
Type:
PROTEIN
Mol. Mass.:
57478.87
Organism:
Rattus norvegicus
Description:
ChEMBL_1475489
Residue:
499
  
Inhibitor
Name:
BDBM7962
Synonyms:
4-(2-Imidazol-1-yl-ethoxy)-benzoic acid; hydrochloride 4-[2-(1H-imidazol-1-yl)ethoxy]benzoic acid CHEMBL537708 dazoxiben
Type:
Small organic molecule
Emp. Form.:
C12H12N2O3
Mol. Mass.:
232.2353
SMILES:
OC(=O)c1ccc(OCCn2ccnc2)cc1
: