Target
72 kDa type IV collagenase
Ligand
BDBM13080
Substrate
Meas. Tech.
ChEMBL_1763088 (CHEMBL4198335)
IC50
14±n/a nM
Citation
 Kumar, DGupta, SKGaneshpurkar, AGutti, GKrishnamurthy, SModi, GSingh, SK Development of Piperazinediones as dual inhibitor for treatment of Alzheimer's disease. Eur J Med Chem 150:87-101 (2018)  
Target
Name:
72 kDa type IV collagenase
Synonyms:
72 kDa gelatinase CLG4A Gelatinase A (MMP-2) MMP2_HUMAN Matrix metalloproteinase-2 (MMP 2) Matrix metalloproteinases 2 (MMP-2) | TBE-1
Type:
Enzyme
Mol. Mass.:
73870.36
Organism:
Homo sapiens (Human)
Description:
P08253
Residue:
660
  
Inhibitor
Name:
BDBM13080
Synonyms:
CGS 27023A Analog 3 US20230357139, Compound A | US20240050571, Compound NNGH
Type:
Small organic molecule
Emp. Form.:
C13H20N2O5S
Mol. Mass.:
316.373
SMILES:
COc1ccc(cc1)S(=O)(=O)N(CC(C)C)CC(=O)NO
: