Target
5-hydroxytryptamine receptor 7
Ligand
BDBM50020221
Substrate
Meas. Tech.
ChEMBL_1764020 (CHEMBL4199267)
Ki
466±n/a nM
Citation
 Modica, MNLacivita, EIntagliata, SSalerno, LRomeo, GPittalą, VLeopoldo, M Structure-Activity Relationships and Therapeutic Potentials of 5-HT J Med Chem 61:8475-8503 (2018)  
Target
Name:
5-hydroxytryptamine receptor 7
Synonyms:
5-HT-7 5-HT7 5-HT7S 5HT7 HTR7 | Serotonin receptor 7
Type:
G Protein-Coupled Receptor (GPCR)
Mol. Mass.:
53573.08
Organism:
Homo sapiens (Human)
Description:
P34969
Residue:
479
  
Inhibitor
Name:
BDBM50020221
Synonyms:
(-)-5-hydroxy-2-(dipropylamino)tetralin 5-hydroxy-2-(dipropylamino)tetralin 6-Dipropylamino-5,6,7,8-tetrahydro-naphthalen-1-ol (DP-5-ADTN) | CHEMBL273273
Type:
Small organic molecule
Emp. Form.:
C16H25NO
Mol. Mass.:
247.3758
SMILES:
CCCN(CCC)C1CCc2c(O)cccc2C1
: