Target
Pepsin A
Ligand
BDBM50022296
Substrate
Meas. Tech.
ChEMBL_154145 (CHEMBL759815)
Ki
3±n/a nM
Citation
 Holladay, MWSalituro, FGRich, DH Synthetic and enzyme inhibition studies of pepstatin analogues containing hydroxyethylene and ketomethylene dipeptide isosteres. J Med Chem 30:374-83 (1987)  
Target
Name:
Pepsin A
Synonyms:
PEPA_PIG Pepsin | Pepsin A precursor
Type:
Enzyme
Mol. Mass.:
41232.87
Organism:
Porcine
Description:
Residue:
385
  
Inhibitor
Name:
BDBM50022296
Synonyms:
3-Hydroxy-6-methyl-4-[3-methyl-2-(3-methyl-butyrylamino)-butyrylamino]-heptanoic acid [1-(3-methyl-butylcarbamoyl)-ethyl]-amide | CHEMBL126961
Type:
Small organic molecule
Emp. Form.:
C26H50N4O5
Mol. Mass.:
498.699
SMILES:
CC(C)CCNC(=O)C(C)NC(=O)C[C@H](O)C(CC(C)C)NC(=O)C(NC(=O)CC(C)C)C(C)C
: