Target
Pepsin A
Ligand
BDBM50022302
Substrate
Meas. Tech.
ChEBML_154015
Ki
3±n/a nM
Citation
 Holladay, MWSalituro, FGRich, DH Synthetic and enzyme inhibition studies of pepstatin analogues containing hydroxyethylene and ketomethylene dipeptide isosteres. J Med Chem 30:374-83 (1987)  
Target
Name:
Pepsin A
Synonyms:
PEPA_PIG Pepsin | Pepsin A precursor
Type:
Enzyme
Mol. Mass.:
41232.87
Organism:
Porcine
Description:
Residue:
385
  
Inhibitor
Name:
BDBM50022302
Synonyms:
CHEMBL339356 | N-(2-Hydroxy-1-isobutyl-4-{1-[1-(3-methyl-butylcarbamoyl)-ethylcarbamoyl]-ethylamino}-butyl)-3-methyl-2-(3-methyl-butyrylamino)-butyramide
Type:
Small organic molecule
Emp. Form.:
C28H54N4O5
Mol. Mass.:
526.7522
SMILES:
CC(C)CCNC(=O)C(C)NC(=O)C(C)C[C@H](O)[C@H](CC(C)C)NC(=O)C(NC(=O)CC(C)C)C(C)C
: