Target
Isocitrate dehydrogenase [NADP] cytoplasmic
Ligand
BDBM50458777
Substrate
Meas. Tech.
ChEMBL_1764687 (CHEMBL4199934)
IC50
45±n/a nM
Citation
 Zhao, QManning, JRSutton, JCostales, ASendzik, MShafer, CMLevell, JRLiu, GCaferro, TCho, YSPalermo, MChenail, GDooley, JVillalba, BFarsidjani, AChen, JDodd, SGould, TLiang, GSlocum, KPu, MFirestone, BGrowney, JHeimbach, TPagliarini, R Optimization of 3-Pyrimidin-4-yl-oxazolidin-2-ones as Orally Bioavailable and Brain Penetrant Mutant IDH1 Inhibitors. ACS Med Chem Lett 9:746-751 (2018)  
Target
Name:
Isocitrate dehydrogenase [NADP] cytoplasmic
Synonyms:
Cytosolic NADP-isocitrate dehydrogenase IDH1 IDP Isocitrate dehydrogenase 1 (IDH1) Oxalosuccinate decarboxylase | PICD
Type:
Protein
Mol. Mass.:
46661.29
Organism:
Homo sapiens (Human)
Description:
O75874
Residue:
414
  
Inhibitor
Name:
BDBM50458777
Synonyms:
CHEMBL4216983
Type:
Small organic molecule
Emp. Form.:
C20H18F4N6O2
Mol. Mass.:
450.3895
SMILES:
C[C@H](Nc1nccc(n1)N1[C@@H](CF)COC1=O)c1cn(cn1)-c1ccc(cc1)C(F)(F)F
: