Target
Phosphatidylcholine:ceramide cholinephosphotransferase 1
Ligand
BDBM50458926
Substrate
Meas. Tech.
ChEMBL_1764948 (CHEMBL4200195)
IC50
48000±n/a nM
Citation
 Mo, MYang, JJiang, XCCao, YFei, JChen, YQi, XChu, YZhou, LYe, D Discovery of 4-Benzyloxybenzo[ d]isoxazole-3-amine Derivatives as Highly Selective and Orally Efficacious Human Sphingomyelin Synthase 2 Inhibitors that Reduce Chronic Inflammation in db/ db Mice. J Med Chem 61:8241-8254 (2018)  
Target
Name:
Phosphatidylcholine:ceramide cholinephosphotransferase 1
Synonyms:
MOB Protein Mob SMS1 Sphingomyelin synthase 1 Transmembrane protein 23
Type:
PROTEIN
Mol. Mass.:
48630.99
Organism:
Homo sapiens (Human)
Description:
ChEMBL_109868
Residue:
413
  
Inhibitor
Name:
BDBM50458926
Synonyms:
CHEMBL4211357
Type:
Small organic molecule
Emp. Form.:
C20H17N3O3
Mol. Mass.:
347.3673
SMILES:
COc1ccccc1COc1cccc2onc(Nc3cccnc3)c12
: