Target
Renin
Ligand
BDBM50022586
Substrate
Meas. Tech.
ChEBML_195773
IC50
2±n/a nM
Citation
 Bühlmayer, PCaselli, AFuhrer, WGöschke, RRasetti, VRüeger, HStanton, JLCriscione, LWood, JM Synthesis and biological activity of some transition-state inhibitors of human renin. J Med Chem 31:1839-46 (1988)  
Target
Name:
Renin
Synonyms:
Angiotensinogenase RENI_HUMAN
Type:
Enzyme
Mol. Mass.:
45058.99
Organism:
Homo sapiens (Human)
Description:
Residue:
406
  
Inhibitor
Name:
BDBM50022586
Synonyms:
5-[2-[2-Benzyl-3-(2-methyl-propane-2-sulfinyl)-propionylamino]-3-(3H-imidazol-4-yl)-propionylamino]-6-cyclohexyl-4-hydroxy-2-isopropyl-hexanoic acid butylamide | CHEMBL52833
Type:
Small organic molecule
Emp. Form.:
C39H63N5O5S
Mol. Mass.:
714.013
SMILES:
CCCCNC(=O)[C@@H](CC(O)[C@H](CC1CCCCC1)NC(=O)[C@H](Cc1cnc[nH]1)NC(=O)[C@H](Cc1ccccc1)CS(=O)C(C)(C)C)C(C)C
: