Target
Renin
Ligand
BDBM50022589
Substrate
Meas. Tech.
ChEBML_195773
IC50
15±n/a nM
Citation
 Bühlmayer, PCaselli, AFuhrer, WGöschke, RRasetti, VRüeger, HStanton, JLCriscione, LWood, JM Synthesis and biological activity of some transition-state inhibitors of human renin. J Med Chem 31:1839-46 (1988)  
Target
Name:
Renin
Synonyms:
Angiotensinogenase RENI_HUMAN
Type:
Enzyme
Mol. Mass.:
45058.99
Organism:
Homo sapiens (Human)
Description:
Residue:
406
  
Inhibitor
Name:
BDBM50022589
Synonyms:
CHEMBL435178 | {1-[1-(4-{1-[1-Carbamoyl-2-(3H-imidazol-4-yl)-ethylcarbamoyl]-2-methyl-butylcarbamoyl}-2-hydroxy-1-isobutyl-5-methyl-hexylcarbamoyl)-2-(3H-imidazol-4-yl)-ethylcarbamoyl]-2-phenyl-ethyl}-carbamic acid tert-butyl ester
Type:
Small organic molecule
Emp. Form.:
C44H68N10O8
Mol. Mass.:
865.0729
SMILES:
CC[C@H](C)[C@H](NC(=O)[C@@H](CC(O)[C@H](CC(C)C)NC(=O)[C@H](Cc1cnc[nH]1)NC(=O)[C@H](Cc1ccccc1)NC(=O)OC(C)(C)C)C(C)C)C(=O)N[C@@H](Cc1cnc[nH]1)C(N)=O
: