Target
Renin
Ligand
BDBM50022588
Substrate
Meas. Tech.
ChEBML_195773
IC50
4±n/a nM
Citation
 Bühlmayer, PCaselli, AFuhrer, WGöschke, RRasetti, VRüeger, HStanton, JLCriscione, LWood, JM Synthesis and biological activity of some transition-state inhibitors of human renin. J Med Chem 31:1839-46 (1988)  
Target
Name:
Renin
Synonyms:
Angiotensinogenase RENI_HUMAN
Type:
Enzyme
Mol. Mass.:
45058.99
Organism:
Homo sapiens (Human)
Description:
Residue:
406
  
Inhibitor
Name:
BDBM50022588
Synonyms:
CHEMBL291787 | {2-[1-(4-Butylcarbamoyl-1-cyclohexylmethyl-2-hydroxy-5-methyl-hexylcarbamoyl)-2-(3H-imidazol-4-yl)-ethylcarbamoyl]-3-phenyl-propyl}-phosphonic acid diethyl ester
Type:
Small organic molecule
Emp. Form.:
C39H64N5O7P
Mol. Mass.:
745.9285
SMILES:
CCCCNC(=O)[C@@H](CC(O)[C@H](CC1CCCCC1)NC(=O)[C@H](Cc1cnc[nH]1)NC(=O)C(Cc1ccccc1)CP(=O)(OCC)OCC)C(C)C
: