Target
Renin
Ligand
BDBM50022587
Substrate
Meas. Tech.
ChEBML_195773
IC50
4±n/a nM
Citation
 Bühlmayer, PCaselli, AFuhrer, WGöschke, RRasetti, VRüeger, HStanton, JLCriscione, LWood, JM Synthesis and biological activity of some transition-state inhibitors of human renin. J Med Chem 31:1839-46 (1988)  
Target
Name:
Renin
Synonyms:
Angiotensinogenase RENI_HUMAN
Type:
Enzyme
Mol. Mass.:
45058.99
Organism:
Homo sapiens (Human)
Description:
Residue:
406
  
Inhibitor
Name:
BDBM50022587
Synonyms:
5-[2-(2-tert-Butylsulfanylmethyl-3-phenyl-propionylamino)-3-(3H-imidazol-4-yl)-propionylamino]-6-cyclohexyl-4-hydroxy-2-isopropyl-hexanoic acid butylamide | CHEMBL52929
Type:
Small organic molecule
Emp. Form.:
C39H63N5O4S
Mol. Mass.:
698.014
SMILES:
CCCCNC(=O)[C@@H](CC(O)[C@H](CC1CCCCC1)NC(=O)[C@H](Cc1cnc[nH]1)NC(=O)[C@@H](CSC(C)(C)C)Cc1ccccc1)C(C)C
: