Target
Renin
Ligand
BDBM50022584
Substrate
Meas. Tech.
ChEBML_195773
IC50
6±n/a nM
Citation
 Bühlmayer, PCaselli, AFuhrer, WGöschke, RRasetti, VRüeger, HStanton, JLCriscione, LWood, JM Synthesis and biological activity of some transition-state inhibitors of human renin. J Med Chem 31:1839-46 (1988)  
Target
Name:
Renin
Synonyms:
Angiotensinogenase RENI_HUMAN
Type:
Enzyme
Mol. Mass.:
45058.99
Organism:
Homo sapiens (Human)
Description:
Residue:
406
  
Inhibitor
Name:
BDBM50022584
Synonyms:
2-Benzyl-5,5-dimethyl-4-oxo-hexanoic acid [1-(4-butylcarbamoyl-1-cyclohexylmethyl-2-hydroxy-5-methyl-hexylcarbamoyl)-2-(3H-imidazol-4-yl)-ethyl]-amide | CHEMBL292812
Type:
Small organic molecule
Emp. Form.:
C40H63N5O5
Mol. Mass.:
693.9587
SMILES:
CCCCNC(=O)[C@@H](CC(O)[C@H](CC1CCCCC1)NC(=O)[C@H](Cc1cnc[nH]1)NC(=O)C(CC(=O)C(C)(C)C)Cc1ccccc1)C(C)C
: