Target
Renin
Ligand
BDBM50022585
Substrate
Meas. Tech.
ChEBML_195773
IC50
20±n/a nM
Citation
 Bühlmayer, PCaselli, AFuhrer, WGöschke, RRasetti, VRüeger, HStanton, JLCriscione, LWood, JM Synthesis and biological activity of some transition-state inhibitors of human renin. J Med Chem 31:1839-46 (1988)  
Target
Name:
Renin
Synonyms:
Angiotensinogenase RENI_HUMAN
Type:
Enzyme
Mol. Mass.:
45058.99
Organism:
Homo sapiens (Human)
Description:
Residue:
406
  
Inhibitor
Name:
BDBM50022585
Synonyms:
5-[2-[2-(2,2-Dimethyl-propionylamino)-3-phenyl-propionylamino]-3-(3H-imidazol-4-yl)-propionylamino]-4-hydroxy-2-isopropyl-7-methyl-octanoic acid {1-[1-carbamoyl-2-(3H-imidazol-4-yl)-ethylcarbamoyl]-2-methyl-butyl}-amide | CHEMBL54322
Type:
Small organic molecule
Emp. Form.:
C44H68N10O7
Mol. Mass.:
849.0735
SMILES:
CC[C@H](C)[C@H](NC(=O)[C@@H](CC(O)[C@H](CC(C)C)NC(=O)[C@H](Cc1cnc[nH]1)NC(=O)[C@H](Cc1ccccc1)NC(=O)C(C)(C)C)C(C)C)C(=O)N[C@@H](Cc1cnc[nH]1)C(N)=O
: