Target
Renin
Ligand
BDBM50022646
Substrate
Meas. Tech.
ChEMBL_196100 (CHEMBL804784)
pH
6±n/a
IC50
0.300000±n/a nM
Comments
extracted
Citation
 Plattner, JJMarcotte, PAKleinert, HDStein, HHGreer, JBolis, GFung, AKBopp, BALuly, JRSham, HL Renin inhibitors. Dipeptide analogues of angiotensinogen utilizing a structurally modified phenylalanine residue to impart proteolytic stability. J Med Chem 31:2277-88 (1989)  
Target
Name:
Renin
Synonyms:
Angiotensinogenase RENI_HUMAN
Type:
Enzyme
Mol. Mass.:
45058.99
Organism:
Homo sapiens (Human)
Description:
Residue:
406
  
Inhibitor
Name:
BDBM50022646
Synonyms:
CHEMBL307917 | Morpholine-4-carboxylic acid {1-[1-(1-cyclohexylmethyl-2,3-dihydroxy-5-methyl-hexylcarbamoyl)-2-(1H-imidazol-4-yl)-ethylcarbamoyl]-3-phenyl-propyl}-amide
Type:
Small organic molecule
Emp. Form.:
C35H54N6O6
Mol. Mass.:
654.8399
SMILES:
CC(C)C[C@H](O)[C@H](O)[C@H](CC1CCCCC1)NC(=O)[C@H](Cc1cnc[nH]1)NC(=O)[C@H](CCc1ccccc1)NC(=O)N1CCOCC1
: