Target
5-hydroxytryptamine receptor 1A
Ligand
BDBM50007173
Substrate
Meas. Tech.
ChEBML_1196
Ki
1±n/a nM
Citation
 Glennon, RANaiman, NALyon, RATiteler, M Arylpiperazine derivatives as high-affinity 5-HT1A serotonin ligands. J Med Chem 31:1968-71 (1988)  
Target
Name:
5-hydroxytryptamine receptor 1A
Synonyms:
5-HT-1A 5-HT1A 5-hydroxytryptamine receptor 1A (5HT1A) 5ht1a Htr1a Serotonin 1a (5-HT1a) receptor/Adrenergic receptor alpha-1 | Serotonin receptor 1A
Type:
G Protein-Coupled Receptor (GPCR)
Mol. Mass.:
46445.29
Organism:
Rattus norvegicus (rat)
Description:
Binding assays were performed using rat hippocampal membranes.
Residue:
422
  
Inhibitor
Name:
BDBM50007173
Synonyms:
2-[4-(4-Naphthalen-1-yl-piperazin-1-yl)-butyl]-isoindole-1,3-dione | CHEMBL26587
Type:
Small organic molecule
Emp. Form.:
C26H27N3O2
Mol. Mass.:
413.5115
SMILES:
O=C1N(CCCCN2CCN(CC2)c2cccc3ccccc23)C(=O)c2ccccc12
: