Target
Oxytocin receptor
Ligand
BDBM50459400
Substrate
Meas. Tech.
ChEMBL_1766372 (CHEMBL4201619)
Ki
61±n/a nM
Citation
 Frantz, MCPellissier, LPPflimlin, ELoison, SGandía, JMarsol, CDurroux, TMouillac, BBecker, JAJLe Merrer, JValencia, CVilla, PBonnet, DHibert, M LIT-001, the First Nonpeptide Oxytocin Receptor Agonist that Improves Social Interaction in a Mouse Model of Autism. J Med Chem 61:8670-8692 (2018)  
Target
Name:
Oxytocin receptor
Synonyms:
OT-R OXYR_HUMAN | Oxytocin
Type:
Enzyme Catalytic Domain
Mol. Mass.:
42793.26
Organism:
Homo sapiens (Human)
Description:
Oxytocin OXTR HEK293::B2R9L7
Residue:
389
  
Inhibitor
Name:
BDBM50459400
Synonyms:
CHEMBL4217872
Type:
Small organic molecule
Emp. Form.:
C25H29N7O2S
Mol. Mass.:
491.608
SMILES:
CN(C)C(=S)CNC(=O)NCc1ccc(cc1C)C(=O)N1Cc2cnn(C)c2Nc2ccccc12
: