Target
Vasopressin V1a receptor
Ligand
BDBM50459394
Substrate
Meas. Tech.
ChEMBL_1766352 (CHEMBL4201599)
Ki
<10.0±n/a nM
Citation
 Frantz, MCPellissier, LPPflimlin, ELoison, SGandía, JMarsol, CDurroux, TMouillac, BBecker, JAJLe Merrer, JValencia, CVilla, PBonnet, DHibert, M LIT-001, the First Nonpeptide Oxytocin Receptor Agonist that Improves Social Interaction in a Mouse Model of Autism. J Med Chem 61:8670-8692 (2018)  
Target
Name:
Vasopressin V1a receptor
Synonyms:
AVPR V1a AVPR1A V1AR_HUMAN VASOPRESSIN V1A Vasopressin V1 receptor Vasopressin receptor
Type:
Receptor
Mol. Mass.:
46820.18
Organism:
Homo sapiens (Human)
Description:
P37288
Residue:
418
  
Inhibitor
Name:
BDBM50459394
Synonyms:
CHEMBL4215258
Type:
Small organic molecule
Emp. Form.:
C21H18ClN3O2
Mol. Mass.:
379.84
SMILES:
Cc1ccn(n1)-c1ccc(C(=O)N2CCCC(=O)c3ccccc23)c(Cl)c1
: