Target
Sodium-dependent noradrenaline transporter
Ligand
BDBM388637
Substrate
Meas. Tech.
ChEMBL_1767583 (CHEMBL4219695)
Ki
1.50±n/a nM
Citation
 Subbaiah, MAM Triple Reuptake Inhibitors as Potential Therapeutics for Depression and Other Disorders: Design Paradigm and Developmental Challenges. J Med Chem 61:2133-2165 (2018)  
Target
Name:
Sodium-dependent noradrenaline transporter
Synonyms:
Monoamine transporter NET Noradrenaline Transporter (NET) Norepinephrine transporter protein (NET) SLC6A2 Sodium-dependent noradrenaline transporter (NET) | Solute carrier family 6 member 2
Type:
Multi-pass membrane protein
Mol. Mass.:
69337.72
Organism:
Homo sapiens (Human)
Description:
P23975
Residue:
617
  
Inhibitor
Name:
BDBM388637
Synonyms:
AZD1858 MCJ001- SS | US9944618, Compound ID No. 173
Type:
Small organic molecule
Emp. Form.:
C20H21NO
Mol. Mass.:
291.3868
SMILES:
CNC[C@@H]([C@H](O)c1ccccc1)c1ccc2ccccc2c1
: