Target
Sodium-dependent serotonin transporter
Ligand
BDBM50459932
Substrate
Meas. Tech.
ChEMBL_1767549 (CHEMBL4219661)
IC50
14±n/a nM
Citation
 Subbaiah, MAM Triple Reuptake Inhibitors as Potential Therapeutics for Depression and Other Disorders: Design Paradigm and Developmental Challenges. J Med Chem 61:2133-2165 (2018)  
Target
Name:
Sodium-dependent serotonin transporter
Synonyms:
5-HT Transporter 5HTT SC6A4_HUMAN SLC6A4 Serotonin transporter (5HTT) Sodium-dependent serotonin transporter (SERT) | Solute carrier family 6 member 4
Type:
Multi-pass membrane protein
Mol. Mass.:
70322.51
Organism:
Homo sapiens (Human)
Description:
P31645
Residue:
630
  
Inhibitor
Name:
BDBM50459932
Synonyms:
CHEMBL4227980
Type:
Small organic molecule
Emp. Form.:
C16H15Cl2N
Mol. Mass.:
292.203
SMILES:
N[C@H]1CC[C@H](c2ccc(Cl)c(Cl)c2)c2ccccc12
: