Target
Sodium-dependent dopamine transporter
Ligand
BDBM50459932
Substrate
Meas. Tech.
ChEMBL_1767551 (CHEMBL4219663)
IC50
2.0±n/a nM
Citation
 Subbaiah, MAM Triple Reuptake Inhibitors as Potential Therapeutics for Depression and Other Disorders: Design Paradigm and Developmental Challenges. J Med Chem 61:2133-2165 (2018)  
Target
Name:
Sodium-dependent dopamine transporter
Synonyms:
DA transporter DAT1 Dopamine transporter protein (DAT) SC6A3_HUMAN Sodium-dependent dopamine transporter Solute carrier family 6 member 3
Type:
Multi-pass membrane protein
Mol. Mass.:
68497.11
Organism:
Homo sapiens (Human)
Description:
Q01959
Residue:
620
  
Inhibitor
Name:
BDBM50459932
Synonyms:
CHEMBL4227980
Type:
Small organic molecule
Emp. Form.:
C16H15Cl2N
Mol. Mass.:
292.203
SMILES:
N[C@H]1CC[C@H](c2ccc(Cl)c(Cl)c2)c2ccccc12
: