Target
Orotidine 5'-phosphate decarboxylase
Ligand
BDBM47402
Substrate
Meas. Tech.
ChEMBL_1768163 (CHEMBL4220275)
Ki
64±n/a nM
Citation
 Slusarczyk, MFerla, SBrancale, AMcGuigan, C Synthesis and biological evaluation of 6-substituted-5-fluorouridine ProTides. Bioorg Med Chem 26:551-565 (2018)  
Target
Name:
Orotidine 5'-phosphate decarboxylase
Synonyms:
Orotidine phosphate decarboxylase URA3
Type:
PROTEIN
Mol. Mass.:
29241.18
Organism:
Saccharomyces cerevisiae
Description:
ChEMBL_639015
Residue:
267
  
Inhibitor
Name:
BDBM47402
Synonyms:
2-[(2R,3R,4S,5R)-3,4-dihydroxy-5-(hydroxymethyl)-2-oxolanyl]-1,2,4-triazine-3,5-dione 2-[(2R,3R,4S,5R)-3,4-dihydroxy-5-methylol-tetrahydrofuran-2-yl]-1,2,4-triazine-3,5-quinone 6-AZAURIDINE SMR000058273 | cid_5901
Type:
Small organic molecule
Emp. Form.:
C8H11N3O6
Mol. Mass.:
245.1894
SMILES:
OC[C@H]1O[C@H]([C@H](O)[C@@H]1O)n1ncc(=O)[nH]c1=O
: