Target
Phenylethanolamine N-methyltransferase
Ligand
BDBM23981
Substrate
Meas. Tech.
ChEBML_153306
Ki
15000±n/a nM
Citation
 Grunewald, GLYe, QKieffer, LMonn, JA Conformational requirements of substrates for activity with phenylethanolamine N-methyltransferase. J Med Chem 31:169-71 (1988)  
Target
Name:
Phenylethanolamine N-methyltransferase
Synonyms:
Noradrenaline N-methyltransferase PNMT_BOVIN | PNMTase
Type:
Enzyme
Mol. Mass.:
30916.97
Organism:
Bos taurus (bovine)
Description:
Residue:
283
  
Inhibitor
Name:
BDBM23981
Synonyms:
(2S)-1,2,3,4-Tetrahydro-naphthalen-2-ylamine CHEMBL30294 | Tetrahydronaphthalen-2-amine, 3a
Type:
Small organic molecule
Emp. Form.:
C10H13N
Mol. Mass.:
147.2169
SMILES:
NC1CCc2ccccc2C1
: