Target
NEDD8-conjugating enzyme Ubc12
Ligand
BDBM50245225
Substrate
Meas. Tech.
ChEMBL_1770455 (CHEMBL4222567)
Kd
1000±n/a nM
Citation
 Hammill, JTScott, DCMin, JConnelly, MCHolbrook, GZhu, FMatheny, AYang, LSingh, BSchulman, BAGuy, RK Piperidinyl Ureas Chemically Control Defective in Cullin Neddylation 1 (DCN1)-Mediated Cullin Neddylation. J Med Chem 61:2680-2693 (2018)  
Target
Name:
NEDD8-conjugating enzyme Ubc12
Synonyms:
2.3.2.- NEDD8-conjugating enzyme Ubc12 UBC12_HUMAN Ubiquitin-conjugating enzyme E2 M
Type:
PROTEIN
Mol. Mass.:
20901.74
Organism:
Homo sapiens
Description:
ChEMBL_118032
Residue:
183
  
Inhibitor
Name:
BDBM50245225
Synonyms:
CHEMBL4099097 | US11116757, No. A15
Type:
Small organic molecule
Emp. Form.:
C25H32F3N3O
Mol. Mass.:
447.5363
SMILES:
CCCC(C)N1CCC(CC1)N(Cc1ccccc1)C(=O)Nc1cccc(c1)C(F)(F)F
: