Target
Ribosyldihydronicotinamide dehydrogenase [quinone]
Ligand
BDBM50461059
Substrate
Meas. Tech.
ChEMBL_1770604 (CHEMBL4222716)
IC50
1111±n/a nM
Citation
 Alnabulsi, SHussein, BSantina, EAlsalahat, IKadirvel, MMagwaza, RNBryce, RASchwalbe, CHBaldwin, AGRusso, IStratford, IJFreeman, S Evaluation of analogues of furan-amidines as inhibitors of NQO2. Bioorg Med Chem Lett 28:1292-1297 (2018)  
Target
Name:
Ribosyldihydronicotinamide dehydrogenase [quinone]
Synonyms:
Metallothionein-3 NQO2 NRH dehydrogenase [quinone] 2 QR2 Quinone reductase 2 (NQO2) | Ribosyldihydronicotinamide dehydrogenase [quinone]
Type:
Protein
Mol. Mass.:
25917.25
Organism:
Homo sapiens (Human)
Description:
P16083
Residue:
231
  
Inhibitor
Name:
BDBM50461059
Synonyms:
CHEMBL4226437
Type:
Small organic molecule
Emp. Form.:
C18H18N4O2
Mol. Mass.:
322.3611
SMILES:
CC(O)=O.NC(=N)c1ccc(cc1)-c1nc(c[nH]1)-c1ccccc1
: