Target
Adenosine receptor A1
Ligand
BDBM50023494
Substrate
Meas. Tech.
ChEBML_28547
IC50
145±n/a nM
Citation
 Francis, JECash, WDPsychoyos, SGhai, GWenk, PFriedmann, RCAtkins, CWarren, VFurness, PHyun, JL Structure-activity profile of a series of novel triazoloquinazoline adenosine antagonists. J Med Chem 31:1014-20 (1988)  
Target
Name:
Adenosine receptor A1
Synonyms:
AA1R_RAT ADENOSINE A1 high Adenosine A1 receptor (A1) Adenosine receptors A1 | Adora1
Type:
Protein
Mol. Mass.:
36704.13
Organism:
Rattus norvegicus (rat)
Description:
Residue:
326
  
Inhibitor
Name:
BDBM50023494
Synonyms:
9-Benzyloxy-2-furan-2-yl-[1,2,4]triazolo[1,5-c]quinazolin-5-ylamine | CHEMBL7748
Type:
Small organic molecule
Emp. Form.:
C20H15N5O2
Mol. Mass.:
357.3654
SMILES:
Nc1nc2ccc(OCc3ccccc3)cc2c2nc(nn12)-c1ccco1
: