Target
Adenosine receptor A1
Ligand
BDBM50023503
Substrate
Meas. Tech.
ChEBML_28547
IC50
324.0±n/a nM
Citation
 Francis, JECash, WDPsychoyos, SGhai, GWenk, PFriedmann, RCAtkins, CWarren, VFurness, PHyun, JL Structure-activity profile of a series of novel triazoloquinazoline adenosine antagonists. J Med Chem 31:1014-20 (1988)  
Target
Name:
Adenosine receptor A1
Synonyms:
AA1R_RAT ADENOSINE A1 high Adenosine A1 receptor (A1) Adenosine receptors A1 | Adora1
Type:
Protein
Mol. Mass.:
36704.13
Organism:
Rattus norvegicus (rat)
Description:
Residue:
326
  
Inhibitor
Name:
BDBM50023503
Synonyms:
9-Chloro-2-thiophen-2-yl-[1,2,4]triazolo[1,5-c]quinazolin-5-ylamine; compound with methanesulfonic acid | CHEMBL266095
Type:
Small organic molecule
Emp. Form.:
C13H8ClN5S
Mol. Mass.:
301.754
SMILES:
Nc1nc2ccc(Cl)cc2c2nc(nn12)-c1cccs1
: