Target
Lysine-specific demethylase 4C
Ligand
BDBM264012
Substrate
Meas. Tech.
ChEMBL_1771180 (CHEMBL4223292)
IC50
38±n/a nM
Citation
 Nie, ZShi, LLai, CO'Connell, SMXu, JStansfield, RKHosfield, DJVeal, JMStafford, JA Structure-based design and discovery of potent and selective KDM5 inhibitors. Bioorg Med Chem Lett 28:1490-1494 (2018)  
Target
Name:
Lysine-specific demethylase 4C
Synonyms:
GASC-1 protein Gene amplified in squamous cell carcinoma 1 protein JMJD2C Jumonji domain-containing protein 2C KDM4C_HUMAN | KIAA0780
Type:
Protein
Mol. Mass.:
119979.01
Organism:
Homo sapiens (Human)
Description:
Q9H3R0
Residue:
1056
  
Inhibitor
Name:
BDBM264012
Synonyms:
2-[5-[(4-chloro-2- methoxyphenyl)methoxy]pyrazol- 1-yl]pyridine-4-carboxylic acid US9604961, Example 90 US9908865, Example 90
Type:
Small organic molecule
Emp. Form.:
C17H14ClN3O4
Mol. Mass.:
359.764
SMILES:
COc1cc(Cl)ccc1COc1ccnn1-c1cc(ccn1)C(O)=O
: