Target
Plasmepsin I
Ligand
BDBM50145775
Substrate
Meas. Tech.
ChEMBL_1771432 (CHEMBL4223544)
IC50
300±n/a nM
Citation
 Rasina, DStakanovs, GBorysov, OVPantelejevs, TBobrovs, RKanepe-Lapsa, ITars, KJaudzems, KJirgensons, A 2-Aminoquinazolin-4(3H)-one based plasmepsin inhibitors with improved hydrophilicity and selectivity. Bioorg Med Chem 26:2488-2500 (2018)  
Target
Name:
Plasmepsin I
Synonyms:
PFAPG PMI Plasmepsin-1 precursor
Type:
Enzyme
Mol. Mass.:
51463.30
Organism:
Plasmodium falciparum
Description:
Residue:
452
  
Inhibitor
Name:
BDBM50145775
Synonyms:
CHEMBL3764174
Type:
Small organic molecule
Emp. Form.:
C30H33N3O2
Mol. Mass.:
467.6019
SMILES:
CCCCCc1ccc(cc1)-c1ccc2c(c1)nc(N)n(C[C@@H]1CC[C@@H](O1)c1ccccc1)c2=O
: