Target
Plasmepsin I
Ligand
BDBM50461477
Substrate
Meas. Tech.
ChEMBL_1771432 (CHEMBL4223544)
IC50
2000±n/a nM
Citation
 Rasina, DStakanovs, GBorysov, OVPantelejevs, TBobrovs, RKanepe-Lapsa, ITars, KJaudzems, KJirgensons, A 2-Aminoquinazolin-4(3H)-one based plasmepsin inhibitors with improved hydrophilicity and selectivity. Bioorg Med Chem 26:2488-2500 (2018)  
Target
Name:
Plasmepsin I
Synonyms:
PFAPG PMI Plasmepsin-1 precursor
Type:
Enzyme
Mol. Mass.:
51463.30
Organism:
Plasmodium falciparum
Description:
Residue:
452
  
Inhibitor
Name:
BDBM50461477
Synonyms:
CHEMBL4228633
Type:
Small organic molecule
Emp. Form.:
C25H24N4O2
Mol. Mass.:
412.4837
SMILES:
Nc1cccc(c1)-c1cc(cc2nc(N)n(CC3CCCO3)c(=O)c12)-c1ccccc1
: