Target
Plasmepsin I
Ligand
BDBM50461485
Substrate
Meas. Tech.
ChEMBL_1771432 (CHEMBL4223544)
IC50
740±n/a nM
Citation
 Rasina, DStakanovs, GBorysov, OVPantelejevs, TBobrovs, RKanepe-Lapsa, ITars, KJaudzems, KJirgensons, A 2-Aminoquinazolin-4(3H)-one based plasmepsin inhibitors with improved hydrophilicity and selectivity. Bioorg Med Chem 26:2488-2500 (2018)  
Target
Name:
Plasmepsin I
Synonyms:
PFAPG PMI Plasmepsin-1 precursor
Type:
Enzyme
Mol. Mass.:
51463.30
Organism:
Plasmodium falciparum
Description:
Residue:
452
  
Inhibitor
Name:
BDBM50461485
Synonyms:
CHEMBL4228072
Type:
Small organic molecule
Emp. Form.:
C31H33N3O4
Mol. Mass.:
511.6114
SMILES:
Nc1nc2cc(cc(CCC(O)=O)c2c(=O)n1CC1CCCO1)-c1ccc(CCCc2ccccc2)cc1
: