Target
ATPase family AAA domain-containing protein 2
Ligand
BDBM50158627
Substrate
Meas. Tech.
ChEMBL_1771651 (CHEMBL4223763)
IC50
>80000±n/a nM
Citation
 Bennett, MJWu, YBoloor, AMatuszkiewicz, JO'Connell, SMShi, LStansfield, RKDel Rosario, JRVeal, JMHosfield, DJXu, JKaldor, SWStafford, JABetancort, JM Design, synthesis and biological evaluation of novel 4-phenylisoquinolinone BET bromodomain inhibitors. Bioorg Med Chem Lett 28:1811-1816 (2018)  
Target
Name:
ATPase family AAA domain-containing protein 2
Synonyms:
AAA nuclear coregulator cancer-associated protein ATAD2 PRO2000
Type:
PROTEIN
Mol. Mass.:
158546.30
Organism:
Homo sapiens (Human)
Description:
ChEMBL_1500426
Residue:
1390
  
Inhibitor
Name:
BDBM50158627
Synonyms:
CHEMBL3787482 | US10023592, Example 81
Type:
Small organic molecule
Emp. Form.:
C24H25N3O4S
Mol. Mass.:
451.538
SMILES:
CCOc1ccc(cc1-c1cn(C)c(=O)c2ccc(cc12)-c1cnn(C)c1)S(=O)(=O)CC
: