Target
Protein-glutamine gamma-glutamyltransferase 2
Ligand
BDBM50461615
Substrate
Meas. Tech.
ChEMBL_1771658 (CHEMBL4223770)
Ki
2450±n/a nM
Target
Name:
Protein-glutamine gamma-glutamyltransferase 2
Synonyms:
Protein-glutamine gamma-glutamyltransferase TGM2 Tissue transglutaminase Transglutaminase 2 (TGM2) Transglutaminase-2
Type:
Protein
Mol. Mass.:
77309.30
Organism:
Homo sapiens (Human)
Description:
P21980
Residue:
687
  
Inhibitor
Name:
BDBM50461615
Synonyms:
CHEMBL4228875
Type:
Small organic molecule
Emp. Form.:
C26H32N6O5
Mol. Mass.:
508.5695
SMILES:
[O-][N+](=O)c1ccc(cn1)N1CCN(CC1)C(=O)[C@H](CCCCNC(=O)C=C)NC(=O)Cc1ccccc1
: