Target
Protein-glutamine gamma-glutamyltransferase 2
Ligand
BDBM50461633
Substrate
Meas. Tech.
ChEMBL_1771658 (CHEMBL4223770)
Ki
2600±n/a nM
Target
Name:
Protein-glutamine gamma-glutamyltransferase 2
Synonyms:
Protein-glutamine gamma-glutamyltransferase TGM2 Tissue transglutaminase Transglutaminase 2 (TGM2) Transglutaminase-2
Type:
Protein
Mol. Mass.:
77309.30
Organism:
Homo sapiens (Human)
Description:
P21980
Residue:
687
  
Inhibitor
Name:
BDBM50461633
Synonyms:
CHEMBL4227896
Type:
Small organic molecule
Emp. Form.:
C26H33N5O3
Mol. Mass.:
463.5719
SMILES:
C=CC(=O)NCCCC[C@H](NC(=O)Cc1ccccc1)C(=O)N1CCN(CC1)c1cccnc1
: