Target
Membrane-associated tyrosine- and threonine-specific cdc2-inhibitory kinase
Ligand
BDBM13216
Substrate
Meas. Tech.
ChEMBL_1776144 (CHEMBL4233136)
IC50
6.0±n/a nM
Citation
 Platzer, CNajjar, ARohe, AErdmann, FSippl, WSchmidt, M Identification of PKMYT1 inhibitors by screening the GSK published protein kinase inhibitor set I and II. Bioorg Med Chem 26:4014-4024 (2018)  
Target
Name:
Membrane-associated tyrosine- and threonine-specific cdc2-inhibitory kinase
Synonyms:
MYT1 PMYT1_HUMAN | Tyrosine- and threonine-specific cdc2-inhibitory kinase
Type:
PROTEIN
Mol. Mass.:
54523.76
Organism:
Homo sapiens (Human)
Description:
ChEMBL_587209
Residue:
499
  
Inhibitor
Name:
BDBM13216
Synonyms:
BMS-354825 DASATINIB N-(2-chloro-6-methylphenyl)-2-({6-[4-(2-hydroxyethyl)piperazin-1-yl]-2-methylpyrimidin-4-yl}amino)-1,3-thiazole-5-carboxamide US20230348453, Compound A8 med.21724, Compound Dasatinib
Type:
Small organic molecule
Emp. Form.:
C22H26ClN7O2S
Mol. Mass.:
488.006
SMILES:
Cc1nc(Nc2ncc(s2)C(=O)Nc2c(C)cccc2Cl)cc(n1)N1CCN(CCO)CC1
: