Target
Thromboxane-A synthase
Ligand
BDBM50024421
Substrate
Meas. Tech.
ChEBML_210453
IC50
3000±n/a nM
Citation
 Press, JBWright, WBChan, PSHaug, MFMarsico, JWTomcufcik, AS Thromboxane synthetase inhibitors and antihypertensive agents. 3. N-[(1H-imidazol-1-yl)alkyl]heteroaryl amides as potent enzyme inhibitors. J Med Chem 30:1036-40 (1987)  
Target
Name:
Thromboxane-A synthase
Synonyms:
Cyp5 Cytochrome P450 5A1 TXA synthase Tbxas1
Type:
PROTEIN
Mol. Mass.:
59971.80
Organism:
Rattus norvegicus
Description:
ChEMBL_209768
Residue:
533
  
Inhibitor
Name:
BDBM50024421
Synonyms:
CHEMBL8778 | Thiophene-2-carboxylic acid (4-imidazol-1-yl-butyl)-amide
Type:
Small organic molecule
Emp. Form.:
C12H15N3OS
Mol. Mass.:
249.332
SMILES:
O=C(NCCCCn1ccnc1)c1cccs1
: