Target
Thromboxane-A synthase
Ligand
BDBM7962
Substrate
Meas. Tech.
ChEBML_210453
IC50
1500±n/a nM
Citation
 Press, JBWright, WBChan, PSHaug, MFMarsico, JWTomcufcik, AS Thromboxane synthetase inhibitors and antihypertensive agents. 3. N-[(1H-imidazol-1-yl)alkyl]heteroaryl amides as potent enzyme inhibitors. J Med Chem 30:1036-40 (1987)  
Target
Name:
Thromboxane-A synthase
Synonyms:
Cyp5 Cytochrome P450 5A1 TXA synthase Tbxas1
Type:
PROTEIN
Mol. Mass.:
59971.80
Organism:
Rattus norvegicus
Description:
ChEMBL_209768
Residue:
533
  
Inhibitor
Name:
BDBM7962
Synonyms:
4-(2-Imidazol-1-yl-ethoxy)-benzoic acid; hydrochloride 4-[2-(1H-imidazol-1-yl)ethoxy]benzoic acid CHEMBL537708 dazoxiben
Type:
Small organic molecule
Emp. Form.:
C12H12N2O3
Mol. Mass.:
232.2353
SMILES:
OC(=O)c1ccc(OCCn2ccnc2)cc1
: