Target
Serine/threonine-protein kinase Sgk2
Ligand
BDBM50463479
Substrate
Meas. Tech.
ChEMBL_1778444 (CHEMBL4235436)
Ki
>2000±n/a nM
Citation
 Bandarage, UKCao, JCome, JHCourt, JJGao, HJacobs, MDMarhefka, CNanthakumar, SGreen, J ROCK inhibitors 3: Design, synthesis and structure-activity relationships of 7-azaindole-based Rho kinase (ROCK) inhibitors. Bioorg Med Chem Lett 28:2622-2626 (2018)  
Target
Name:
Serine/threonine-protein kinase Sgk2
Synonyms:
SGK2 | SGK2_HUMAN
Type:
PROTEIN
Mol. Mass.:
47609.83
Organism:
Homo sapiens (Human)
Description:
ChEMBL_1445193
Residue:
427
  
Inhibitor
Name:
BDBM50463479
Synonyms:
CHEMBL4249925
Type:
Small organic molecule
Emp. Form.:
C19H17N5O3S2
Mol. Mass.:
427.5
SMILES:
CS(=O)(=O)Nc1cccc(CC(=O)Nc2nc(cs2)-c2c[nH]c3ncccc23)c1
: