Target
Histone deacetylase 11
Ligand
BDBM50463738
Substrate
Meas. Tech.
ChEMBL_1779306 (CHEMBL4236298)
Ki
38±n/a nM
Citation
 Fournier, JFBhurruth-Alcor, YMusicki, BAubert, JAurelly, MBouix-Peter, CBouquet, KChantalat, LDelorme, MDrean, BDuvert, GFleury-Bregeot, NGauthier, BGrisendi, KHarris, CSHennequin, LFIsabet, TJoly, FLafitte, GMillois, CMorgentin, RPascau, JPiwnica, DRival, YSoulet, CThoreau, ÉTomas, L Squaramides as novel class I and IIB histone deacetylase inhibitors for topical treatment of cutaneous t-cell lymphoma. Bioorg Med Chem Lett 28:2985-2992 (2018)  
Target
Name:
Histone deacetylase 11
Synonyms:
HD11 HDAC11 | Human HDAC11
Type:
Chromatin regulator; hydrolase; repressor
Mol. Mass.:
39187.66
Organism:
Homo sapiens (Human)
Description:
Q96DB2
Residue:
347
  
Inhibitor
Name:
BDBM50463738
Synonyms:
CHEMBL4244764
Type:
Small organic molecule
Emp. Form.:
C22H33N3O4
Mol. Mass.:
403.5151
SMILES:
CC(Nc1c(NCCCCCC(=O)NO)c(=O)c1=O)C12CC3CC(CC(C3)C1)C2
: