Target
Cholinesterase
Ligand
BDBM50464028
Substrate
Meas. Tech.
ChEMBL_1779756 (CHEMBL4236748)
Ki
90±n/a nM
Citation
 Ghobadian, RNadri, HMoradi, ABukhari, SNAMahdavi, MAsadi, MAkbarzadeh, TKhaleghzadeh-Ahangar, HSharifzadeh, MAmini, M Design, synthesis, and biological evaluation of selective and potent Carbazole-based butyrylcholinesterase inhibitors. Bioorg Med Chem 26:4952-4962 (2018)  
Target
Name:
Cholinesterase
Synonyms:
BCHE CHLE_HORSE | Cholinesterase
Type:
Enzyme
Mol. Mass.:
65643.35
Organism:
Equus caballus (Horse)
Description:
P81908
Residue:
574
  
Inhibitor
Name:
BDBM50464028
Synonyms:
CHEMBL4241164
Type:
Small organic molecule
Emp. Form.:
C25H20Cl2N2
Mol. Mass.:
419.346
SMILES:
[Cl-].Clc1ccc(C[n+]2cccc(Cn3c4ccccc4c4ccccc34)c2)cc1
: