Target
Bromodomain-containing protein 4
Ligand
BDBM50098251
Substrate
Meas. Tech.
ChEMBL_1780008 (CHEMBL4237000)
IC50
631±n/a nM
Citation
 Bamborough, PChung, CWFurze, RCGrandi, PMichon, AMWatson, RJMitchell, DJBarnett, HPrinjha, RKRau, CSheppard, RJWerner, TDemont, EH Aiming to Miss a Moving Target: Bromo and Extra Terminal Domain (BET) Selectivity in Constrained ATAD2 Inhibitors. J Med Chem 61:8321-8336 (2018)  
Target
Name:
Bromodomain-containing protein 4
Synonyms:
BRD4 Bromodomain-containing protein 4 (BRD4) Protein HUNK1
Type:
Protein
Mol. Mass.:
152264.84
Organism:
Homo sapiens (Human)
Description:
O60885
Residue:
1362
  
Inhibitor
Name:
BDBM50098251
Synonyms:
CHEMBL3590391
Type:
Small organic molecule
Emp. Form.:
C26H34N6O2
Mol. Mass.:
462.5872
SMILES:
Cc1cc2c(cnc(N[C@@H]3CCNC[C@H]3OCC3CCCCC3)c2[nH]c1=O)-c1cncc(N)c1
: